Information card for entry 7034223
Formula | C20 H52 Cl6 Nb2 O12 Sn2 |
Calculated formula | C20 H52 Cl6 Nb2 O12 Sn2 |
Title of publication | A convenient and quantitative route to Sn(iv)-M [M = Ti(iv), Nb(v), Ta(v)] heterobimetallic precursors for dense mixed-metal oxide ceramics. |
Authors of publication | Mishra, Shashank; Jeanneau, Erwann; Mangematin, Stéphane; Chermette, Henry; Poor Kalhor, Mahboubeh; Bonnefont, Guillaume; Fantozzi, Gilbert; Le Floch, Sylvie; Pailhes, Stéphane; Daniele, Stéphane |
Journal of publication | Dalton transactions (Cambridge, England : 2003) |
Year of publication | 2015 |
Journal volume | 44 |
Journal issue | 15 |
Pages of publication | 6848 - 6862 |
a | 17.503 ± 0.001 Å |
b | 11.651 ± 0.001 Å |
c | 19.801 ± 0.002 Å |
α | 90° |
β | 92.935 ± 0.007° |
γ | 90° |
Cell volume | 4032.7 ± 0.6 Å3 |
Cell temperature | 150 K |
Ambient diffraction temperature | 150 K |
Number of distinct elements | 6 |
Space group number | 9 |
Hermann-Mauguin space group symbol | C 1 c 1 |
Hall space group symbol | C -2yc |
Residual factor for all reflections | 0.0564 |
Residual factor for significantly intense reflections | 0.0439 |
Weighted residual factors for all reflections | 0.1107 |
Weighted residual factors for significantly intense reflections | 0.1042 |
Weighted residual factors for all reflections included in the refinement | 0.1107 |
Goodness-of-fit parameter for all reflections included in the refinement | 0.962 |
Diffraction radiation wavelength | 0.71069 Å |
Diffraction radiation type | MoKα |