Information card for entry 7034229
Formula | C27 H65 Cl3 O10 Sn Ti2 |
Calculated formula | C27 H65 Cl3 O10 Sn Ti2 |
SMILES | C(C)(C)O[Sn]1([O]2[Ti]([O]1C(C)C)(OC(C)C)(OC(C)C)[O](C(C)C)[Ti]2(OC(C)C)(OC(C)C)([OH]C(C)C)[OH]C(C)C)(Cl)(Cl)Cl |
Title of publication | A convenient and quantitative route to Sn(iv)-M [M = Ti(iv), Nb(v), Ta(v)] heterobimetallic precursors for dense mixed-metal oxide ceramics. |
Authors of publication | Mishra, Shashank; Jeanneau, Erwann; Mangematin, Stéphane; Chermette, Henry; Poor Kalhor, Mahboubeh; Bonnefont, Guillaume; Fantozzi, Gilbert; Le Floch, Sylvie; Pailhes, Stéphane; Daniele, Stéphane |
Journal of publication | Dalton transactions (Cambridge, England : 2003) |
Year of publication | 2015 |
Journal volume | 44 |
Journal issue | 15 |
Pages of publication | 6848 - 6862 |
a | 10.3378 ± 0.0008 Å |
b | 11.3589 ± 0.0008 Å |
c | 19.978 ± 0.001 Å |
α | 88.599 ± 0.006° |
β | 75.838 ± 0.006° |
γ | 66.319 ± 0.007° |
Cell volume | 2075.9 ± 0.3 Å3 |
Cell temperature | 150 K |
Ambient diffraction temperature | 150 K |
Number of distinct elements | 6 |
Space group number | 2 |
Hermann-Mauguin space group symbol | P -1 |
Hall space group symbol | -P 1 |
Residual factor for all reflections | 0.0657 |
Residual factor for significantly intense reflections | 0.0528 |
Weighted residual factors for all reflections | 0.1195 |
Weighted residual factors for significantly intense reflections | 0.1001 |
Weighted residual factors for all reflections included in the refinement | 0.1195 |
Goodness-of-fit parameter for all reflections included in the refinement | 1.0041 |
Diffraction radiation wavelength | 0.7107 Å |
Diffraction radiation type | MoKα |