Information card for entry 7034230
Formula | C12 H32 Cl4 Nb O6 Sn |
Calculated formula | C12 H31 Cl4 Nb O6 Sn |
Title of publication | A convenient and quantitative route to Sn(iv)-M [M = Ti(iv), Nb(v), Ta(v)] heterobimetallic precursors for dense mixed-metal oxide ceramics. |
Authors of publication | Mishra, Shashank; Jeanneau, Erwann; Mangematin, Stéphane; Chermette, Henry; Poor Kalhor, Mahboubeh; Bonnefont, Guillaume; Fantozzi, Gilbert; Le Floch, Sylvie; Pailhes, Stéphane; Daniele, Stéphane |
Journal of publication | Dalton transactions (Cambridge, England : 2003) |
Year of publication | 2015 |
Journal volume | 44 |
Journal issue | 15 |
Pages of publication | 6848 - 6862 |
a | 9.32 ± 0.001 Å |
b | 19.198 ± 0.002 Å |
c | 14.026 ± 0.002 Å |
α | 90° |
β | 105.88 ± 0.01° |
γ | 90° |
Cell volume | 2413.8 ± 0.5 Å3 |
Cell temperature | 110 K |
Ambient diffraction temperature | 110 K |
Number of distinct elements | 6 |
Space group number | 15 |
Hermann-Mauguin space group symbol | C 1 2/c 1 |
Hall space group symbol | -C 2yc |
Residual factor for all reflections | 0.0978 |
Residual factor for significantly intense reflections | 0.0746 |
Weighted residual factors for all reflections | 0.1759 |
Weighted residual factors for significantly intense reflections | 0.1444 |
Weighted residual factors for all reflections included in the refinement | 0.1759 |
Goodness-of-fit parameter for all reflections included in the refinement | 0.9174 |
Diffraction radiation wavelength | 0.7107 Å |
Diffraction radiation type | MoKα |