Information card for entry 7034233
Formula | C61 H96.5 Cl3 In2 N4.5 O3 |
Calculated formula | C61 H96.5 Cl3 In2 N4.5 O3 |
Title of publication | The effect of steric changes on the isoselectivity of dinuclear indium catalysts for lactide polymerization. |
Authors of publication | Osten, K. M.; Aluthge, D. C.; Mehrkhodavandi, P. |
Journal of publication | Dalton transactions (Cambridge, England : 2003) |
Year of publication | 2015 |
Journal volume | 44 |
Journal issue | 13 |
Pages of publication | 6126 - 6139 |
a | 12.8751 ± 0.001 Å |
b | 15.9412 ± 0.0012 Å |
c | 16.5097 ± 0.0012 Å |
α | 64.991 ± 0.002° |
β | 87.64 ± 0.002° |
γ | 87.658 ± 0.002° |
Cell volume | 3067.2 ± 0.4 Å3 |
Cell temperature | 90 ± 1 K |
Ambient diffraction temperature | 90 ± 1 K |
Number of distinct elements | 6 |
Space group number | 2 |
Hermann-Mauguin space group symbol | P -1 |
Hall space group symbol | -P 1 |
Residual factor for all reflections | 0.0417 |
Residual factor for significantly intense reflections | 0.0294 |
Weighted residual factors for significantly intense reflections | 0.0719 |
Weighted residual factors for all reflections included in the refinement | 0.0766 |
Goodness-of-fit parameter for all reflections included in the refinement | 1.021 |
Diffraction radiation wavelength | 0.71073 Å |
Diffraction radiation type | MoKα |