Information card for entry 7034232
Formula | C23.25 H32.5 Cl In0.5 N O0.5 |
Calculated formula | C23.25 H32.5 Cl In0.5 N O0.5 |
Title of publication | The effect of steric changes on the isoselectivity of dinuclear indium catalysts for lactide polymerization. |
Authors of publication | Osten, K. M.; Aluthge, D. C.; Mehrkhodavandi, P. |
Journal of publication | Dalton transactions (Cambridge, England : 2003) |
Year of publication | 2015 |
Journal volume | 44 |
Journal issue | 13 |
Pages of publication | 6126 - 6139 |
a | 10.0632 ± 0.0012 Å |
b | 14.7651 ± 0.0017 Å |
c | 15.5923 ± 0.0019 Å |
α | 89.62 ± 0.003° |
β | 73.121 ± 0.003° |
γ | 73.901 ± 0.003° |
Cell volume | 2123.1 ± 0.4 Å3 |
Cell temperature | 90 ± 1 K |
Ambient diffraction temperature | 90 ± 1 K |
Number of distinct elements | 6 |
Space group number | 2 |
Hermann-Mauguin space group symbol | P -1 |
Hall space group symbol | -P 1 |
Residual factor for all reflections | 0.0381 |
Residual factor for significantly intense reflections | 0.0282 |
Weighted residual factors for significantly intense reflections | 0.0486 |
Weighted residual factors for all reflections included in the refinement | 0.0505 |
Goodness-of-fit parameter for all reflections included in the refinement | 0.926 |
Diffraction radiation wavelength | 0.71073 Å |
Diffraction radiation type | MoKα |