Information card for entry 7034247
Formula | C26 H30 N6 O6 Pd |
Calculated formula | C26 H30 N6 O6 Pd |
SMILES | [Pd]1([n]2c(c3cccc[n]13)cccc2)(N1C(=O)C(C(=O)NC1=O)(CC)CC)N1C(=O)C(C(=O)NC1=O)(CC)CC |
Title of publication | New palladium(ii) and platinum(ii) 5,5-diethylbarbiturate complexes with 2-phenylpyridine, 2,2'-bipyridine and 2,2'-dipyridylamine: synthesis, structures, DNA binding, molecular docking, cellular uptake, antioxidant activity and cytotoxicity. |
Authors of publication | Icsel, Ceyda; Yilmaz, Veysel T.; Kaya, Yunus; Samli, Hale; Harrison, William T. A.; Buyukgungor, Orhan |
Journal of publication | Dalton transactions (Cambridge, England : 2003) |
Year of publication | 2015 |
Journal volume | 44 |
Journal issue | 15 |
Pages of publication | 6880 - 6895 |
a | 11.546 ± 0.0002 Å |
b | 22.1844 ± 0.0006 Å |
c | 13.245 ± 0.0003 Å |
α | 90° |
β | 99.2996 ± 0.0013° |
γ | 90° |
Cell volume | 3348 ± 0.13 Å3 |
Cell temperature | 120 ± 2 K |
Ambient diffraction temperature | 120 ± 2 K |
Number of distinct elements | 5 |
Space group number | 14 |
Hermann-Mauguin space group symbol | P 1 21/c 1 |
Hall space group symbol | -P 2ybc |
Residual factor for all reflections | 0.061 |
Residual factor for significantly intense reflections | 0.0482 |
Weighted residual factors for significantly intense reflections | 0.1129 |
Weighted residual factors for all reflections included in the refinement | 0.117 |
Goodness-of-fit parameter for all reflections included in the refinement | 1.083 |
Diffraction radiation wavelength | 0.71073 Å |
Diffraction radiation type | MoKα |