Information card for entry 7034248
Formula | C26 H30 N6 O6 Pt |
Calculated formula | C26 H30 N6 O6 Pt |
SMILES | [Pt]1([n]2c(c3cccc[n]13)cccc2)(N1C(=O)C(C(=O)NC1=O)(CC)CC)N1C(=O)C(C(=O)NC1=O)(CC)CC |
Title of publication | New palladium(ii) and platinum(ii) 5,5-diethylbarbiturate complexes with 2-phenylpyridine, 2,2'-bipyridine and 2,2'-dipyridylamine: synthesis, structures, DNA binding, molecular docking, cellular uptake, antioxidant activity and cytotoxicity. |
Authors of publication | Icsel, Ceyda; Yilmaz, Veysel T.; Kaya, Yunus; Samli, Hale; Harrison, William T. A.; Buyukgungor, Orhan |
Journal of publication | Dalton transactions (Cambridge, England : 2003) |
Year of publication | 2015 |
Journal volume | 44 |
Journal issue | 15 |
Pages of publication | 6880 - 6895 |
a | 11.5076 ± 0.0003 Å |
b | 22.355 ± 0.0007 Å |
c | 13.2889 ± 0.0004 Å |
α | 90° |
β | 99.2282 ± 0.0017° |
γ | 90° |
Cell volume | 3374.36 ± 0.17 Å3 |
Cell temperature | 120 ± 2 K |
Ambient diffraction temperature | 120 ± 2 K |
Number of distinct elements | 5 |
Space group number | 14 |
Hermann-Mauguin space group symbol | P 1 21/c 1 |
Hall space group symbol | -P 2ybc |
Residual factor for all reflections | 0.0414 |
Residual factor for significantly intense reflections | 0.0321 |
Weighted residual factors for significantly intense reflections | 0.0834 |
Weighted residual factors for all reflections included in the refinement | 0.0866 |
Goodness-of-fit parameter for all reflections included in the refinement | 1.056 |
Diffraction radiation wavelength | 0.71073 Å |
Diffraction radiation type | MoKα |