Information card for entry 7034283
Formula | C35 H46 Br4 Mn3 N5 O8 |
Calculated formula | C35 H44 Br4 Mn3 N5 O8 |
Title of publication | Self-assembly of linear [Mn(II)2Mn(III)] units with end-on azido bridges: the construction of a ferromagnetic chain using ST = 7 high-spin trimers. |
Authors of publication | Jiang, Yuan; Qin, Lei; Li, Guanghua; Abbas, Ghulam; Cao, Yaqun; Wu, Gang; Han, Tian; Zheng, Yan-Zhen; Qiu, Shilun |
Journal of publication | Dalton transactions (Cambridge, England : 2003) |
Year of publication | 2015 |
Journal volume | 44 |
Journal issue | 11 |
Pages of publication | 5205 - 5210 |
a | 8.5966 ± 0.0017 Å |
b | 11.893 ± 0.002 Å |
c | 12.358 ± 0.003 Å |
α | 73.3 ± 0.03° |
β | 75.79 ± 0.03° |
γ | 73.84 ± 0.03° |
Cell volume | 1143.4 ± 0.5 Å3 |
Cell temperature | 293 ± 2 K |
Ambient diffraction temperature | 293 ± 2 K |
Number of distinct elements | 6 |
Space group number | 2 |
Hermann-Mauguin space group symbol | P -1 |
Hall space group symbol | -P 1 |
Residual factor for all reflections | 0.108 |
Residual factor for significantly intense reflections | 0.0653 |
Weighted residual factors for significantly intense reflections | 0.1936 |
Weighted residual factors for all reflections included in the refinement | 0.225 |
Goodness-of-fit parameter for all reflections included in the refinement | 1.026 |
Diffraction radiation wavelength | 0.71073 Å |
Diffraction radiation type | MoKα |