Information card for entry 7034284
Formula | C40 H64 Br5 Mn3 N2 O12 |
Calculated formula | C40 H64 Br5 Mn3 N2 O12 |
Title of publication | Self-assembly of linear [Mn(II)2Mn(III)] units with end-on azido bridges: the construction of a ferromagnetic chain using ST = 7 high-spin trimers. |
Authors of publication | Jiang, Yuan; Qin, Lei; Li, Guanghua; Abbas, Ghulam; Cao, Yaqun; Wu, Gang; Han, Tian; Zheng, Yan-Zhen; Qiu, Shilun |
Journal of publication | Dalton transactions (Cambridge, England : 2003) |
Year of publication | 2015 |
Journal volume | 44 |
Journal issue | 11 |
Pages of publication | 5205 - 5210 |
a | 7.8658 ± 0.0016 Å |
b | 12.814 ± 0.003 Å |
c | 13.709 ± 0.003 Å |
α | 86.61 ± 0.03° |
β | 87.84 ± 0.03° |
γ | 74.27 ± 0.03° |
Cell volume | 1327.4 ± 0.5 Å3 |
Cell temperature | 293 ± 2 K |
Ambient diffraction temperature | 293 ± 2 K |
Number of distinct elements | 6 |
Space group number | 2 |
Hermann-Mauguin space group symbol | P -1 |
Hall space group symbol | -P 1 |
Residual factor for all reflections | 0.0962 |
Residual factor for significantly intense reflections | 0.0616 |
Weighted residual factors for significantly intense reflections | 0.1697 |
Weighted residual factors for all reflections included in the refinement | 0.1968 |
Goodness-of-fit parameter for all reflections included in the refinement | 1.046 |
Diffraction radiation wavelength | 0.71073 Å |
Diffraction radiation type | MoKα |