Information card for entry 7034292
Formula | C25 H21 Cl N4 O |
Calculated formula | C25 H21 Cl N4 O |
SMILES | c12ccc(cc1cc(c(n2)Cl)C1n2c3ccccc3nc2c2ccccc2N1)C.CO |
Title of publication | A dual-responsive "turn-on" bifunctional receptor: a chemosensor for Fe(3+) and chemodosimeter for Hg(2.). |
Authors of publication | Mukhopadhyay, Sujay; Gupta, Rakesh Kumar; Biswas, Arnab; Kumar, Amit; Dubey, Mrigendra; Hundal, Maninder Singh; Pandey, Daya Shankar |
Journal of publication | Dalton transactions (Cambridge, England : 2003) |
Year of publication | 2015 |
Journal volume | 44 |
Journal issue | 16 |
Pages of publication | 7118 - 7122 |
a | 12.708 ± 0.003 Å |
b | 18.351 ± 0.003 Å |
c | 9.0615 ± 0.0017 Å |
α | 90° |
β | 92.622 ± 0.006° |
γ | 90° |
Cell volume | 2111 ± 0.7 Å3 |
Cell temperature | 296 ± 2 K |
Ambient diffraction temperature | 296 ± 2 K |
Number of distinct elements | 5 |
Space group number | 14 |
Hermann-Mauguin space group symbol | P 1 21/c 1 |
Hall space group symbol | -P 2ybc |
Residual factor for all reflections | 0.1545 |
Residual factor for significantly intense reflections | 0.0703 |
Weighted residual factors for significantly intense reflections | 0.1875 |
Weighted residual factors for all reflections included in the refinement | 0.2381 |
Goodness-of-fit parameter for all reflections included in the refinement | 1.02 |
Diffraction radiation wavelength | 0.71073 Å |
Diffraction radiation type | MoKα |