Information card for entry 7034291
Formula | C64 H46 Co2 N8 O15 |
Calculated formula | C64 H46 Co2 N8 O15 |
Title of publication | Solvent-induced synthesis of cobalt(ii) coordination polymers based on a rigid ligand and flexible carboxylic acid ligands: syntheses, structures and magnetic properties. |
Authors of publication | Wang, Ting; Zhang, Chuanlei; Ju, Zemin; Zheng, Hegen |
Journal of publication | Dalton transactions (Cambridge, England : 2003) |
Year of publication | 2015 |
Journal volume | 44 |
Journal issue | 15 |
Pages of publication | 6926 - 6935 |
a | 25.614 ± 0.002 Å |
b | 12.2428 ± 0.0012 Å |
c | 18.9927 ± 0.0019 Å |
α | 90° |
β | 112.679 ± 0.002° |
γ | 90° |
Cell volume | 5495.4 ± 0.9 Å3 |
Cell temperature | 293 ± 2 K |
Ambient diffraction temperature | 293 ± 2 K |
Number of distinct elements | 5 |
Space group number | 15 |
Hermann-Mauguin space group symbol | C 1 2/c 1 |
Hall space group symbol | -C 2yc |
Residual factor for all reflections | 0.066 |
Residual factor for significantly intense reflections | 0.0537 |
Weighted residual factors for significantly intense reflections | 0.1397 |
Weighted residual factors for all reflections included in the refinement | 0.1494 |
Goodness-of-fit parameter for all reflections included in the refinement | 0.869 |
Diffraction radiation wavelength | 0.71073 Å |
Diffraction radiation type | MoKα |