Information card for entry 7034302
Formula | C34 H44 Ni O2 P2 |
Calculated formula | C34 H44 Ni O2 P2 |
Title of publication | Reactions of phenylacetylene with nickel POCOP-pincer hydride complexes resulting in different outcomes from their palladium analogues. |
Authors of publication | Wilson, Gleason L. O.; Abraha, Medhanei; Krause, Jeanette A.; Guan, Hairong |
Journal of publication | Dalton transactions (Cambridge, England : 2003) |
Year of publication | 2015 |
Journal volume | 44 |
Journal issue | 27 |
Pages of publication | 12128 - 12136 |
a | 14.3061 ± 0.0002 Å |
b | 14.3061 ± 0.0002 Å |
c | 15.3464 ± 0.0002 Å |
α | 90° |
β | 90° |
γ | 90° |
Cell volume | 3140.86 ± 0.07 Å3 |
Cell temperature | 150 ± 2 K |
Ambient diffraction temperature | 150 ± 2 K |
Number of distinct elements | 5 |
Space group number | 92 |
Hermann-Mauguin space group symbol | P 41 21 2 |
Hall space group symbol | P 4abw 2nw |
Residual factor for all reflections | 0.0408 |
Residual factor for significantly intense reflections | 0.036 |
Weighted residual factors for significantly intense reflections | 0.0906 |
Weighted residual factors for all reflections included in the refinement | 0.094 |
Goodness-of-fit parameter for all reflections included in the refinement | 1.048 |
Diffraction radiation wavelength | 1.54178 Å |
Diffraction radiation type | CuKα |