Information card for entry 7034315
Chemical name | Poly[aqua(nitrato-k2O,O')(mu4-pyrimidine-4,6-dicarboxylato-k2N,O:k2N',O':k2O,O'':kO''')lanthanum(III)] |
Formula | C6 H4 La N3 O8 |
Calculated formula | C6 H4 La N3 O8 |
Title of publication | Enhancing luminescence properties of lanthanide(iii)/pyrimidine-4,6-dicarboxylato system by solvent-free approach. |
Authors of publication | Cepeda, Javier; Pérez-Yáñez, Sonia; Beobide, Garikoitz; Castillo, Oscar; García, José Ángel; Lanchas, Mónica; Luque, Antonio |
Journal of publication | Dalton transactions (Cambridge, England : 2003) |
Year of publication | 2015 |
Journal volume | 44 |
Journal issue | 15 |
Pages of publication | 6972 - 6986 |
a | 8.722 ± 0.0002 Å |
b | 12.282 ± 0.0002 Å |
c | 9.578 ± 0.0002 Å |
α | 90° |
β | 96.64 ± 0.002° |
γ | 90° |
Cell volume | 1019.15 ± 0.04 Å3 |
Cell temperature | 100 ± 2 K |
Ambient diffraction temperature | 100 ± 2 K |
Number of distinct elements | 5 |
Space group number | 14 |
Hermann-Mauguin space group symbol | P 1 21/n 1 |
Hall space group symbol | -P 2yn |
Residual factor for all reflections | 0.0175 |
Residual factor for significantly intense reflections | 0.017 |
Weighted residual factors for significantly intense reflections | 0.0439 |
Weighted residual factors for all reflections included in the refinement | 0.0443 |
Goodness-of-fit parameter for all reflections included in the refinement | 1.059 |
Diffraction radiation wavelength | 1.5418 Å |
Diffraction radiation type | CuKα |