Information card for entry 7034316
Chemical name | Poly[aqua(nitrato-k2O,O')(mu4-pyrimidine-4,6-dicarboxylato-k2N,O:k2N',O':k2O,O'':kO''')neodymium(III)] |
Formula | C6 H4 N3 Nd O8 |
Calculated formula | C6 H4 N3 Nd O8 |
Title of publication | Enhancing luminescence properties of lanthanide(iii)/pyrimidine-4,6-dicarboxylato system by solvent-free approach. |
Authors of publication | Cepeda, Javier; Pérez-Yáñez, Sonia; Beobide, Garikoitz; Castillo, Oscar; García, José Ángel; Lanchas, Mónica; Luque, Antonio |
Journal of publication | Dalton transactions (Cambridge, England : 2003) |
Year of publication | 2015 |
Journal volume | 44 |
Journal issue | 15 |
Pages of publication | 6972 - 6986 |
a | 8.632 ± 0.0002 Å |
b | 12.147 ± 0.0003 Å |
c | 9.452 ± 0.0002 Å |
α | 90° |
β | 96.879 ± 0.001° |
γ | 90° |
Cell volume | 983.94 ± 0.04 Å3 |
Cell temperature | 100 ± 2 K |
Ambient diffraction temperature | 100 ± 2 K |
Number of distinct elements | 5 |
Space group number | 14 |
Hermann-Mauguin space group symbol | P 1 21/n 1 |
Hall space group symbol | -P 2yn |
Residual factor for all reflections | 0.0325 |
Residual factor for significantly intense reflections | 0.0238 |
Weighted residual factors for significantly intense reflections | 0.0426 |
Weighted residual factors for all reflections included in the refinement | 0.0446 |
Goodness-of-fit parameter for all reflections included in the refinement | 1.026 |
Diffraction radiation wavelength | 0.71073 Å |
Diffraction radiation type | MoKα |