Information card for entry 7034319
Formula | C8 H28 Mn N6 O Se7 Sn3 |
Calculated formula | C8 H28 Mn N6 O Se7 Sn3 |
Title of publication | Varied forms of lamellar [Sn3Se7]n(2n-) anion: the competitive and synergistic structure-directing effects of metal-amine complex and imidazolium cations. |
Authors of publication | Du, Cheng-Feng; Li, Jian-Rong; Feng, Mei-Ling; Zou, Guo-Dong; Shen, Nan-Nan; Huang, Xiao-Ying |
Journal of publication | Dalton transactions (Cambridge, England : 2003) |
Year of publication | 2015 |
Journal volume | 44 |
Journal issue | 16 |
Pages of publication | 7364 - 7372 |
a | 12.3987 ± 0.0005 Å |
b | 13.315 ± 0.0004 Å |
c | 16.6672 ± 0.0006 Å |
α | 90° |
β | 96.378 ± 0.004° |
γ | 90° |
Cell volume | 2734.54 ± 0.17 Å3 |
Cell temperature | 295 ± 2 K |
Ambient diffraction temperature | 295 ± 2 K |
Number of distinct elements | 7 |
Space group number | 14 |
Hermann-Mauguin space group symbol | P 1 21/n 1 |
Hall space group symbol | -P 2yn |
Residual factor for all reflections | 0.045 |
Residual factor for significantly intense reflections | 0.0306 |
Weighted residual factors for significantly intense reflections | 0.0605 |
Weighted residual factors for all reflections included in the refinement | 0.0658 |
Goodness-of-fit parameter for all reflections included in the refinement | 1.017 |
Diffraction radiation wavelength | 0.71073 Å |
Diffraction radiation type | MoKα |