Information card for entry 7034320
Formula | C39 H99 Cl Mn2 N18 Se21 Sn9 |
Calculated formula | C39 H99 Cl Mn2 N18 Se21 Sn9 |
Title of publication | Varied forms of lamellar [Sn3Se7]n(2n-) anion: the competitive and synergistic structure-directing effects of metal-amine complex and imidazolium cations. |
Authors of publication | Du, Cheng-Feng; Li, Jian-Rong; Feng, Mei-Ling; Zou, Guo-Dong; Shen, Nan-Nan; Huang, Xiao-Ying |
Journal of publication | Dalton transactions (Cambridge, England : 2003) |
Year of publication | 2015 |
Journal volume | 44 |
Journal issue | 16 |
Pages of publication | 7364 - 7372 |
a | 19.4488 ± 0.0005 Å |
b | 19.5108 ± 0.0005 Å |
c | 26.6148 ± 0.0007 Å |
α | 90° |
β | 109.587 ± 0.003° |
γ | 90° |
Cell volume | 9514.9 ± 0.5 Å3 |
Cell temperature | 100 ± 2 K |
Ambient diffraction temperature | 100 ± 2 K |
Number of distinct elements | 7 |
Space group number | 14 |
Hermann-Mauguin space group symbol | P 1 21/c 1 |
Hall space group symbol | -P 2ybc |
Residual factor for all reflections | 0.0757 |
Residual factor for significantly intense reflections | 0.0553 |
Weighted residual factors for significantly intense reflections | 0.1223 |
Weighted residual factors for all reflections included in the refinement | 0.1333 |
Goodness-of-fit parameter for all reflections included in the refinement | 1.037 |
Diffraction radiation wavelength | 0.71073 Å |
Diffraction radiation type | MoKα |