Information card for entry 7034334
Common name | 1d |
Formula | C22 H34 N4 O S |
Calculated formula | C22 H34 N4 O S |
Title of publication | Imidazol-2-ylidene-N'-phenylureate ligands in alkali and alkaline earth metal coordination spheres - heterocubane core to polymeric structural motif formation. |
Authors of publication | Naktode, Kishor; Bhattacharjee, Jayeeta; Nayek, Hari Pada; Panda, Tarun K. |
Journal of publication | Dalton transactions (Cambridge, England : 2003) |
Year of publication | 2015 |
Journal volume | 44 |
Journal issue | 16 |
Pages of publication | 7458 - 7469 |
a | 30.9905 ± 0.0015 Å |
b | 30.9905 ± 0.0015 Å |
c | 12.3331 ± 0.0006 Å |
α | 90° |
β | 90° |
γ | 120° |
Cell volume | 10257.9 ± 0.9 Å3 |
Cell temperature | 150 ± 2 K |
Ambient diffraction temperature | 150 ± 2 K |
Number of distinct elements | 5 |
Space group number | 148 |
Hermann-Mauguin space group symbol | R -3 :H |
Hall space group symbol | -R 3 |
Residual factor for all reflections | 0.0728 |
Residual factor for significantly intense reflections | 0.0596 |
Weighted residual factors for significantly intense reflections | 0.1686 |
Weighted residual factors for all reflections included in the refinement | 0.1833 |
Goodness-of-fit parameter for all reflections included in the refinement | 1.065 |
Diffraction radiation wavelength | 0.7107 Å |
Diffraction radiation type | MoKα |