Information card for entry 7034335
Formula | C128 H148 K4 N16 O8 |
Calculated formula | C128 H148 K4 N16 O8 |
Title of publication | Imidazol-2-ylidene-N'-phenylureate ligands in alkali and alkaline earth metal coordination spheres - heterocubane core to polymeric structural motif formation. |
Authors of publication | Naktode, Kishor; Bhattacharjee, Jayeeta; Nayek, Hari Pada; Panda, Tarun K. |
Journal of publication | Dalton transactions (Cambridge, England : 2003) |
Year of publication | 2015 |
Journal volume | 44 |
Journal issue | 16 |
Pages of publication | 7458 - 7469 |
a | 15.1711 ± 0.0006 Å |
b | 15.1711 ± 0.0006 Å |
c | 25.4506 ± 0.0013 Å |
α | 90° |
β | 90° |
γ | 90° |
Cell volume | 5857.8 ± 0.4 Å3 |
Cell temperature | 150 ± 2 K |
Ambient diffraction temperature | 150 ± 2 K |
Number of distinct elements | 5 |
Space group number | 114 |
Hermann-Mauguin space group symbol | P -4 21 c |
Hall space group symbol | P -4 2n |
Residual factor for all reflections | 0.076 |
Residual factor for significantly intense reflections | 0.0586 |
Weighted residual factors for significantly intense reflections | 0.1573 |
Weighted residual factors for all reflections included in the refinement | 0.1771 |
Goodness-of-fit parameter for all reflections included in the refinement | 1.043 |
Diffraction radiation wavelength | 1.54184 Å |
Diffraction radiation type | CuKα |