Information card for entry 7034346
Formula | C30 H28 Cl6 F3 N4 O3 Pd S |
Calculated formula | C30 H28 Cl6 F3 N4 O3 Pd S |
Title of publication | Organo-palladium(ii) complexes bearing unsymmetrical N,N,N-pincer ligands: synthesis, structures and oxidatively induced coupling reactions. |
Authors of publication | Wright, Luka A.; Hope, Eric G.; Solan, Gregory A.; Cross, Warren B.; Singh, Kuldip |
Journal of publication | Dalton transactions (Cambridge, England : 2003) |
Year of publication | 2015 |
Journal volume | 44 |
Journal issue | 16 |
Pages of publication | 7230 - 7241 |
a | 14.155 ± 0.007 Å |
b | 16.226 ± 0.008 Å |
c | 17.503 ± 0.008 Å |
α | 89.109 ± 0.009° |
β | 76.364 ± 0.011° |
γ | 70.267 ± 0.01° |
Cell volume | 3668 ± 3 Å3 |
Cell temperature | 150 ± 2 K |
Ambient diffraction temperature | 150 ± 2 K |
Number of distinct elements | 8 |
Space group number | 2 |
Hermann-Mauguin space group symbol | P -1 |
Hall space group symbol | -P 1 |
Residual factor for all reflections | 0.2711 |
Residual factor for significantly intense reflections | 0.1055 |
Weighted residual factors for significantly intense reflections | 0.2112 |
Weighted residual factors for all reflections included in the refinement | 0.2821 |
Goodness-of-fit parameter for all reflections included in the refinement | 0.829 |
Diffraction radiation wavelength | 0.71073 Å |
Diffraction radiation type | MoKα |