Information card for entry 7034347
Formula | C25 H29 N3 |
Calculated formula | C25 H29 N3 |
SMILES | N(=C(C)\c1nc(ccc1)c1c(N)cccc1)/c1c(cccc1C(C)C)C(C)C |
Title of publication | Organo-palladium(ii) complexes bearing unsymmetrical N,N,N-pincer ligands: synthesis, structures and oxidatively induced coupling reactions. |
Authors of publication | Wright, Luka A.; Hope, Eric G.; Solan, Gregory A.; Cross, Warren B.; Singh, Kuldip |
Journal of publication | Dalton transactions (Cambridge, England : 2003) |
Year of publication | 2015 |
Journal volume | 44 |
Journal issue | 16 |
Pages of publication | 7230 - 7241 |
a | 12.906 ± 0.01 Å |
b | 8.308 ± 0.006 Å |
c | 39.43 ± 0.03 Å |
α | 90° |
β | 90° |
γ | 90° |
Cell volume | 4228 ± 6 Å3 |
Cell temperature | 150 ± 2 K |
Ambient diffraction temperature | 150 ± 2 K |
Number of distinct elements | 3 |
Space group number | 61 |
Hermann-Mauguin space group symbol | P b c a |
Hall space group symbol | -P 2ac 2ab |
Residual factor for all reflections | 0.1397 |
Residual factor for significantly intense reflections | 0.0628 |
Weighted residual factors for significantly intense reflections | 0.1155 |
Weighted residual factors for all reflections included in the refinement | 0.1377 |
Goodness-of-fit parameter for all reflections included in the refinement | 0.871 |
Diffraction radiation wavelength | 0.71073 Å |
Diffraction radiation type | MoKα |