Information card for entry 7034380
Formula | C6 H18 As N4 Nd S3 |
Calculated formula | C6 H18 As N4 Nd S3 |
Title of publication | A series of new lanthanoid thioarsenates: insights into the influence of lanthanide contraction on the formation of new lanthanoid thioarsenates. |
Authors of publication | Zhou, Jian; Zhao, Rong-Qing; Yang, Tao; Liu, Xing; Xiao, Hong-Ping; Zou, Hua-Hong; Tan, Xiao-Feng |
Journal of publication | Dalton transactions (Cambridge, England : 2003) |
Year of publication | 2015 |
Journal volume | 44 |
Journal issue | 16 |
Pages of publication | 7203 - 7212 |
a | 19.648 ± 0.004 Å |
b | 9.625 ± 0.003 Å |
c | 14.947 ± 0.003 Å |
α | 90° |
β | 90° |
γ | 90° |
Cell volume | 2826.7 ± 1.2 Å3 |
Cell temperature | 296 ± 2 K |
Ambient diffraction temperature | 296 ± 2 K |
Number of distinct elements | 6 |
Space group number | 41 |
Hermann-Mauguin space group symbol | A b a 2 |
Hall space group symbol | A 2 -2ab |
Residual factor for all reflections | 0.0194 |
Residual factor for significantly intense reflections | 0.0186 |
Weighted residual factors for significantly intense reflections | 0.0399 |
Weighted residual factors for all reflections included in the refinement | 0.0401 |
Goodness-of-fit parameter for all reflections included in the refinement | 1.109 |
Diffraction radiation wavelength | 0.71073 Å |
Diffraction radiation type | MoKα |