Information card for entry 7034381
Formula | C6 H18 As N4 S3 Sm |
Calculated formula | C6 H18 As N4 S3 Sm |
Title of publication | A series of new lanthanoid thioarsenates: insights into the influence of lanthanide contraction on the formation of new lanthanoid thioarsenates. |
Authors of publication | Zhou, Jian; Zhao, Rong-Qing; Yang, Tao; Liu, Xing; Xiao, Hong-Ping; Zou, Hua-Hong; Tan, Xiao-Feng |
Journal of publication | Dalton transactions (Cambridge, England : 2003) |
Year of publication | 2015 |
Journal volume | 44 |
Journal issue | 16 |
Pages of publication | 7203 - 7212 |
a | 19.4659 ± 0.0018 Å |
b | 9.57 ± 0.0009 Å |
c | 14.7915 ± 0.0014 Å |
α | 90° |
β | 90° |
γ | 90° |
Cell volume | 2755.5 ± 0.4 Å3 |
Cell temperature | 296 ± 2 K |
Ambient diffraction temperature | 296 ± 2 K |
Number of distinct elements | 6 |
Space group number | 41 |
Hermann-Mauguin space group symbol | A b a 2 |
Hall space group symbol | A 2 -2ab |
Residual factor for all reflections | 0.0225 |
Residual factor for significantly intense reflections | 0.0222 |
Weighted residual factors for significantly intense reflections | 0.0538 |
Weighted residual factors for all reflections included in the refinement | 0.054 |
Goodness-of-fit parameter for all reflections included in the refinement | 1.086 |
Diffraction radiation wavelength | 0.71073 Å |
Diffraction radiation type | MoKα |