Information card for entry 7034382
Formula | C8 H26 As La N6 S4 |
Calculated formula | C8 H26 As La N6 S4 |
Title of publication | A series of new lanthanoid thioarsenates: insights into the influence of lanthanide contraction on the formation of new lanthanoid thioarsenates. |
Authors of publication | Zhou, Jian; Zhao, Rong-Qing; Yang, Tao; Liu, Xing; Xiao, Hong-Ping; Zou, Hua-Hong; Tan, Xiao-Feng |
Journal of publication | Dalton transactions (Cambridge, England : 2003) |
Year of publication | 2015 |
Journal volume | 44 |
Journal issue | 16 |
Pages of publication | 7203 - 7212 |
a | 8.3601 ± 0.0002 Å |
b | 11.2089 ± 0.0003 Å |
c | 19.8455 ± 0.0005 Å |
α | 90° |
β | 90° |
γ | 90° |
Cell volume | 1859.67 ± 0.08 Å3 |
Cell temperature | 296 ± 2 K |
Ambient diffraction temperature | 296 ± 2 K |
Number of distinct elements | 6 |
Space group number | 19 |
Hermann-Mauguin space group symbol | P 21 21 21 |
Hall space group symbol | P 2ac 2ab |
Residual factor for all reflections | 0.0324 |
Residual factor for significantly intense reflections | 0.0279 |
Weighted residual factors for significantly intense reflections | 0.046 |
Weighted residual factors for all reflections included in the refinement | 0.0477 |
Goodness-of-fit parameter for all reflections included in the refinement | 1.017 |
Diffraction radiation wavelength | 0.71073 Å |
Diffraction radiation type | MoKα |