Information card for entry 7034397
Formula | C28 H26 Cl4 O P Sb |
Calculated formula | C28 H26 Cl4 O P Sb |
Title of publication | A tetranuclear arylstibonic acid with an adamantane type structure. |
Authors of publication | Brünig, Julian; Hupf, Emanuel; Lork, Enno; Mebs, Stefan; Beckmann, Jens |
Journal of publication | Dalton transactions (Cambridge, England : 2003) |
Year of publication | 2015 |
Journal volume | 44 |
Journal issue | 16 |
Pages of publication | 7105 - 7108 |
a | 9.6541 ± 0.0005 Å |
b | 10.0084 ± 0.0005 Å |
c | 16.5724 ± 0.0008 Å |
α | 101.464 ± 0.002° |
β | 106.588 ± 0.002° |
γ | 90.666 ± 0.002° |
Cell volume | 1500.01 ± 0.13 Å3 |
Cell temperature | 173 K |
Ambient diffraction temperature | 173 K |
Number of distinct elements | 6 |
Space group number | 2 |
Hermann-Mauguin space group symbol | P -1 |
Hall space group symbol | -P 1 |
Residual factor for all reflections | 0.0237 |
Residual factor for significantly intense reflections | 0.0209 |
Weighted residual factors for significantly intense reflections | 0.0551 |
Weighted residual factors for all reflections included in the refinement | 0.0566 |
Goodness-of-fit parameter for all reflections included in the refinement | 1.098 |
Diffraction radiation probe | x-ray |
Diffraction radiation wavelength | 0.71073 Å |
Diffraction radiation type | MoKα |