Information card for entry 7034405
Formula | C88 H74 F18 Fe2 N6 O0 Os P7 |
Calculated formula | C88 H74 F18 Fe2 N6 Os P7 |
SMILES | [Os]12([n]3cccc4c3c3[n]1cccc3cc4)([n]1cccc3c1c1[n]2cccc1cc3)(C#[N][Fe]12345([P](CC[P]1(c1ccccc1)c1ccccc1)(c1ccccc1)c1ccccc1)[cH]1[cH]2[cH]3[cH]4[cH]51)C#[N][Fe]12345([P](CC[P]1(c1ccccc1)c1ccccc1)(c1ccccc1)c1ccccc1)[cH]1[cH]5[cH]4[cH]3[cH]21.[P](F)(F)(F)(F)(F)[F-].[P](F)(F)(F)(F)(F)[F-].[P](F)(F)(F)(F)(F)[F-] |
Title of publication | Influence of the central diamagnetic cyanidometal on the distant magnetic interaction in cyanide-bridged Fe(iii)-M(ii)-Fe(iii) complexes. |
Authors of publication | Wang, Yong; Lin, Chensheng; Ma, Xiao; Xue, Zhenzhen; Zhu, Xiaoquan; Cao, Wenhai; Hu, Shengmin; Sheng, Tianlu; Wu, Xintao |
Journal of publication | Dalton transactions (Cambridge, England : 2003) |
Year of publication | 2015 |
Journal volume | 44 |
Journal issue | 16 |
Pages of publication | 7437 - 7448 |
a | 12.768 ± 0.007 Å |
b | 32.866 ± 0.018 Å |
c | 23.45 ± 0.012 Å |
α | 90° |
β | 114.2 ± 0.02° |
γ | 90° |
Cell volume | 8976 ± 8 Å3 |
Cell temperature | 123 ± 2 K |
Ambient diffraction temperature | 123 ± 2 K |
Number of distinct elements | 8 |
Space group number | 14 |
Hermann-Mauguin space group symbol | P 1 21/c 1 |
Hall space group symbol | -P 2ybc |
Residual factor for all reflections | 0.1139 |
Residual factor for significantly intense reflections | 0.0918 |
Weighted residual factors for significantly intense reflections | 0.2208 |
Weighted residual factors for all reflections included in the refinement | 0.2449 |
Goodness-of-fit parameter for all reflections included in the refinement | 1.1 |
Diffraction radiation wavelength | 0.71073 Å |
Diffraction radiation type | MoKα |