Information card for entry 7034406
Formula | C90 H77 F24 Fe2 N7 O0 Os P8 |
Calculated formula | C90 H77 F24 Fe2 N7 Os P8 |
Title of publication | Influence of the central diamagnetic cyanidometal on the distant magnetic interaction in cyanide-bridged Fe(iii)-M(ii)-Fe(iii) complexes. |
Authors of publication | Wang, Yong; Lin, Chensheng; Ma, Xiao; Xue, Zhenzhen; Zhu, Xiaoquan; Cao, Wenhai; Hu, Shengmin; Sheng, Tianlu; Wu, Xintao |
Journal of publication | Dalton transactions (Cambridge, England : 2003) |
Year of publication | 2015 |
Journal volume | 44 |
Journal issue | 16 |
Pages of publication | 7437 - 7448 |
a | 17.461 ± 0.003 Å |
b | 22.961 ± 0.004 Å |
c | 23.66 ± 0.004 Å |
α | 90° |
β | 107.212 ± 0.003° |
γ | 90° |
Cell volume | 9061 ± 3 Å3 |
Cell temperature | 123 ± 2 K |
Ambient diffraction temperature | 123 ± 2 K |
Number of distinct elements | 8 |
Space group number | 14 |
Hermann-Mauguin space group symbol | P 1 21/c 1 |
Hall space group symbol | -P 2ybc |
Residual factor for all reflections | 0.0779 |
Residual factor for significantly intense reflections | 0.0666 |
Weighted residual factors for significantly intense reflections | 0.1469 |
Weighted residual factors for all reflections included in the refinement | 0.1546 |
Goodness-of-fit parameter for all reflections included in the refinement | 1.089 |
Diffraction radiation wavelength | 0.71073 Å |
Diffraction radiation type | MoKα |