Information card for entry 7034407
Formula | C90 H88 Cl4 F12 Fe3 N6 O P6 |
Calculated formula | C90 H88 Cl4 F12 Fe3 N6 O P6 |
Title of publication | Influence of the central diamagnetic cyanidometal on the distant magnetic interaction in cyanide-bridged Fe(iii)-M(ii)-Fe(iii) complexes. |
Authors of publication | Wang, Yong; Lin, Chensheng; Ma, Xiao; Xue, Zhenzhen; Zhu, Xiaoquan; Cao, Wenhai; Hu, Shengmin; Sheng, Tianlu; Wu, Xintao |
Journal of publication | Dalton transactions (Cambridge, England : 2003) |
Year of publication | 2015 |
Journal volume | 44 |
Journal issue | 16 |
Pages of publication | 7437 - 7448 |
a | 11.294 ± 0.005 Å |
b | 33.956 ± 0.014 Å |
c | 25.136 ± 0.01 Å |
α | 90° |
β | 110.097 ± 0.017° |
γ | 90° |
Cell volume | 9053 ± 7 Å3 |
Cell temperature | 123 ± 2 K |
Ambient diffraction temperature | 123 ± 2 K |
Number of distinct elements | 8 |
Space group number | 14 |
Hermann-Mauguin space group symbol | P 1 21/c 1 |
Hall space group symbol | -P 2ybc |
Residual factor for all reflections | 0.1488 |
Residual factor for significantly intense reflections | 0.1069 |
Weighted residual factors for significantly intense reflections | 0.2104 |
Weighted residual factors for all reflections included in the refinement | 0.2354 |
Goodness-of-fit parameter for all reflections included in the refinement | 1.012 |
Diffraction radiation wavelength | 0.71073 Å |
Diffraction radiation type | MoKα |