Information card for entry 7034409
Formula | C92 H82 Cl8 F12 Fe3 N6 O0 P6 |
Calculated formula | C92 H82 Cl8 F12 Fe3 N6 P6 |
Title of publication | Influence of the central diamagnetic cyanidometal on the distant magnetic interaction in cyanide-bridged Fe(iii)-M(ii)-Fe(iii) complexes. |
Authors of publication | Wang, Yong; Lin, Chensheng; Ma, Xiao; Xue, Zhenzhen; Zhu, Xiaoquan; Cao, Wenhai; Hu, Shengmin; Sheng, Tianlu; Wu, Xintao |
Journal of publication | Dalton transactions (Cambridge, England : 2003) |
Year of publication | 2015 |
Journal volume | 44 |
Journal issue | 16 |
Pages of publication | 7437 - 7448 |
a | 28.122 ± 0.007 Å |
b | 19.966 ± 0.005 Å |
c | 33.171 ± 0.008 Å |
α | 90° |
β | 90° |
γ | 90° |
Cell volume | 18625 ± 8 Å3 |
Cell temperature | 123 ± 2 K |
Ambient diffraction temperature | 123 ± 2 K |
Number of distinct elements | 8 |
Space group number | 61 |
Hermann-Mauguin space group symbol | P b c a |
Hall space group symbol | -P 2ac 2ab |
Residual factor for all reflections | 0.0921 |
Residual factor for significantly intense reflections | 0.0782 |
Weighted residual factors for significantly intense reflections | 0.2015 |
Weighted residual factors for all reflections included in the refinement | 0.2177 |
Goodness-of-fit parameter for all reflections included in the refinement | 1.08 |
Diffraction radiation wavelength | 0.71073 Å |
Diffraction radiation type | MoKα |