Information card for entry 7034410
Formula | C94 H86 F18 Fe3 N8 O P7 |
Calculated formula | C94 H86 F18 Fe3 N8 O P7 |
Title of publication | Influence of the central diamagnetic cyanidometal on the distant magnetic interaction in cyanide-bridged Fe(iii)-M(ii)-Fe(iii) complexes. |
Authors of publication | Wang, Yong; Lin, Chensheng; Ma, Xiao; Xue, Zhenzhen; Zhu, Xiaoquan; Cao, Wenhai; Hu, Shengmin; Sheng, Tianlu; Wu, Xintao |
Journal of publication | Dalton transactions (Cambridge, England : 2003) |
Year of publication | 2015 |
Journal volume | 44 |
Journal issue | 16 |
Pages of publication | 7437 - 7448 |
a | 12.464 ± 0.005 Å |
b | 33.789 ± 0.011 Å |
c | 23.65 ± 0.006 Å |
α | 90° |
β | 113.419 ± 0.015° |
γ | 90° |
Cell volume | 9140 ± 5 Å3 |
Cell temperature | 123 ± 2 K |
Ambient diffraction temperature | 123 ± 2 K |
Number of distinct elements | 7 |
Space group number | 14 |
Hermann-Mauguin space group symbol | P 1 21/c 1 |
Hall space group symbol | -P 2ybc |
Residual factor for all reflections | 0.0926 |
Residual factor for significantly intense reflections | 0.0778 |
Weighted residual factors for significantly intense reflections | 0.1988 |
Weighted residual factors for all reflections included in the refinement | 0.2192 |
Goodness-of-fit parameter for all reflections included in the refinement | 1.083 |
Diffraction radiation wavelength | 0.71073 Å |
Diffraction radiation type | MoKα |