Information card for entry 7034421
Formula | C21 H18 Cl2 N4 O5 Zn |
Calculated formula | C21 H18 Cl2 N4 O5 Zn |
Title of publication | Designed synthesis of a series of zwitterion-polyoxometalate hybrid materials for selective scavenging and photolysis of dyes. |
Authors of publication | Ou, Sha; Zheng, Jun-Ping; Kong, Guo-Qiang; Wu, Chuan-De |
Journal of publication | Dalton transactions (Cambridge, England : 2003) |
Year of publication | 2015 |
Journal volume | 44 |
Journal issue | 17 |
Pages of publication | 7862 - 7869 |
a | 14.5366 ± 0.001 Å |
b | 18.2023 ± 0.0012 Å |
c | 8.0806 ± 0.0006 Å |
α | 90° |
β | 90° |
γ | 90° |
Cell volume | 2138.1 ± 0.3 Å3 |
Cell temperature | 293 ± 2 K |
Ambient diffraction temperature | 293 ± 2 K |
Number of distinct elements | 6 |
Space group number | 62 |
Hermann-Mauguin space group symbol | P n m a |
Hall space group symbol | -P 2ac 2n |
Residual factor for all reflections | 0.1105 |
Residual factor for significantly intense reflections | 0.0758 |
Weighted residual factors for significantly intense reflections | 0.1744 |
Weighted residual factors for all reflections included in the refinement | 0.1961 |
Goodness-of-fit parameter for all reflections included in the refinement | 1.02 |
Diffraction radiation wavelength | 0.71073 Å |
Diffraction radiation type | MoKα |