Information card for entry 7034422
Formula | C42 H32 N8 O48 P W12 Zn |
Calculated formula | C42 H32 N8 O48 P W12 Zn |
Title of publication | Designed synthesis of a series of zwitterion-polyoxometalate hybrid materials for selective scavenging and photolysis of dyes. |
Authors of publication | Ou, Sha; Zheng, Jun-Ping; Kong, Guo-Qiang; Wu, Chuan-De |
Journal of publication | Dalton transactions (Cambridge, England : 2003) |
Year of publication | 2015 |
Journal volume | 44 |
Journal issue | 17 |
Pages of publication | 7862 - 7869 |
a | 21.205 ± 0.002 Å |
b | 30.853 ± 0.002 Å |
c | 19.6747 ± 0.0016 Å |
α | 90° |
β | 100.033 ± 0.008° |
γ | 90° |
Cell volume | 12675.1 ± 1.8 Å3 |
Cell temperature | 293 ± 2 K |
Ambient diffraction temperature | 293 ± 2 K |
Number of distinct elements | 7 |
Space group number | 15 |
Hermann-Mauguin space group symbol | C 1 2/c 1 |
Hall space group symbol | -C 2yc |
Residual factor for all reflections | 0.1544 |
Residual factor for significantly intense reflections | 0.0848 |
Weighted residual factors for significantly intense reflections | 0.2025 |
Weighted residual factors for all reflections included in the refinement | 0.222 |
Goodness-of-fit parameter for all reflections included in the refinement | 1.106 |
Diffraction radiation wavelength | 0.71073 Å |
Diffraction radiation type | MoKα |