Information card for entry 7034442
Formula | C20 H24 Cu I N2 |
Calculated formula | C20 H24 Cu I N2 |
SMILES | [Cu]1([n]2c(ccc3ccc4c([n]1c(cc4)C(C)(C)C)c23)C(C)(C)C)I |
Title of publication | Luminescent copper(i) halide and pseudohalide phenanthroline complexes revisited: simple structures, complicated excited state behavior. |
Authors of publication | Nitsch, Jörn; Kleeberg, Christian; Fröhlich, Roland; Steffen, Andreas |
Journal of publication | Dalton transactions (Cambridge, England : 2003) |
Year of publication | 2015 |
Journal volume | 44 |
Journal issue | 15 |
Pages of publication | 6944 - 6960 |
a | 20.4147 ± 0.0004 Å |
b | 9.7229 ± 0.0002 Å |
c | 19.5841 ± 0.0003 Å |
α | 90° |
β | 90° |
γ | 90° |
Cell volume | 3887.25 ± 0.13 Å3 |
Cell temperature | 223 ± 2 K |
Ambient diffraction temperature | 223 ± 2 K |
Number of distinct elements | 5 |
Space group number | 29 |
Hermann-Mauguin space group symbol | P c a 21 |
Hall space group symbol | P 2c -2ac |
Residual factor for all reflections | 0.0616 |
Residual factor for significantly intense reflections | 0.0554 |
Weighted residual factors for significantly intense reflections | 0.1252 |
Weighted residual factors for all reflections included in the refinement | 0.1319 |
Goodness-of-fit parameter for all reflections included in the refinement | 1.09 |
Diffraction radiation wavelength | 0.71073 Å |
Diffraction radiation type | MoKα |