Information card for entry 7034443
Formula | C28 H20 Cl N10 O Zn2 |
Calculated formula | C28 H20 Cl N10 O Zn2 |
Title of publication | Photodimerization behaviour of 1D-3D Zn(ii) coordination polymers with tetrazolyl styrylpyridine. |
Authors of publication | Shu, Yu-Bo; Tu, Na; Shi, Hua-Tian; Yin, Ye-Gao; Liu, Wei-Sheng |
Journal of publication | Dalton transactions (Cambridge, England : 2003) |
Year of publication | 2015 |
Journal volume | 44 |
Journal issue | 16 |
Pages of publication | 7131 - 7134 |
a | 14.0528 ± 0.0006 Å |
b | 17.8524 ± 0.0007 Å |
c | 11.238 ± 0.0005 Å |
α | 90° |
β | 102.949 ± 0.005° |
γ | 90° |
Cell volume | 2747.7 ± 0.2 Å3 |
Cell temperature | 295 ± 2 K |
Ambient diffraction temperature | 295 ± 2 K |
Number of distinct elements | 6 |
Space group number | 14 |
Hermann-Mauguin space group symbol | P 1 21/c 1 |
Hall space group symbol | -P 2ybc |
Residual factor for all reflections | 0.091 |
Residual factor for significantly intense reflections | 0.0518 |
Weighted residual factors for significantly intense reflections | 0.109 |
Weighted residual factors for all reflections included in the refinement | 0.1287 |
Goodness-of-fit parameter for all reflections included in the refinement | 1.009 |
Diffraction radiation wavelength | 0.71073 Å |
Diffraction radiation type | MoKα |