Information card for entry 7034454
Formula | C16 H21 F6 O3 P Ru |
Calculated formula | C16 H21 F6 O3 P Ru |
SMILES | [Ru]123456789([cH]%10[cH]1[cH]2[cH]3[cH]4%10)[cH]1[cH]5[cH]6[cH]7[cH]8[c]91OCCOCCOC.[P](F)(F)(F)(F)(F)[F-] |
Title of publication | Colorless organometallic ionic liquids from cationic ruthenium sandwich complexes: thermal properties, liquid properties, and crystal structures of [Ru(η(5)-C5H5)(η(6)-C6H5R)][X] (X = N(SO2CF3)2, N(SO2F)2, PF6). |
Authors of publication | Komurasaki, Aina; Funasako, Yusuke; Mochida, Tomoyuki |
Journal of publication | Dalton transactions (Cambridge, England : 2003) |
Year of publication | 2015 |
Journal volume | 44 |
Journal issue | 16 |
Pages of publication | 7595 - 7605 |
a | 10.573 ± 0.003 Å |
b | 14.685 ± 0.004 Å |
c | 14.804 ± 0.003 Å |
α | 90° |
β | 128.135 ± 0.012° |
γ | 90° |
Cell volume | 1807.9 ± 0.9 Å3 |
Cell temperature | 100 K |
Ambient diffraction temperature | 100 K |
Number of distinct elements | 6 |
Space group number | 14 |
Hermann-Mauguin space group symbol | P 1 21/c 1 |
Hall space group symbol | -P 2ybc |
Residual factor for all reflections | 0.044 |
Residual factor for significantly intense reflections | 0.0421 |
Weighted residual factors for significantly intense reflections | 0.111 |
Weighted residual factors for all reflections included in the refinement | 0.1128 |
Goodness-of-fit parameter for all reflections included in the refinement | 1.069 |
Diffraction radiation wavelength | 0.71073 Å |
Diffraction radiation type | MoKα |