Information card for entry 7034455
Formula | C18 H22 F6 N O P Ru |
Calculated formula | C18 H22 F6 N O P Ru |
Title of publication | Colorless organometallic ionic liquids from cationic ruthenium sandwich complexes: thermal properties, liquid properties, and crystal structures of [Ru(η(5)-C5H5)(η(6)-C6H5R)][X] (X = N(SO2CF3)2, N(SO2F)2, PF6). |
Authors of publication | Komurasaki, Aina; Funasako, Yusuke; Mochida, Tomoyuki |
Journal of publication | Dalton transactions (Cambridge, England : 2003) |
Year of publication | 2015 |
Journal volume | 44 |
Journal issue | 16 |
Pages of publication | 7595 - 7605 |
a | 9.871 ± 0.002 Å |
b | 19.268 ± 0.005 Å |
c | 20.87 ± 0.005 Å |
α | 90° |
β | 96.111 ± 0.004° |
γ | 90° |
Cell volume | 3946.8 ± 1.6 Å3 |
Cell temperature | 100 K |
Ambient diffraction temperature | 100 K |
Number of distinct elements | 7 |
Space group number | 15 |
Hermann-Mauguin space group symbol | C 1 2/c 1 |
Hall space group symbol | -C 2yc |
Residual factor for all reflections | 0.0594 |
Residual factor for significantly intense reflections | 0.0414 |
Weighted residual factors for significantly intense reflections | 0.093 |
Weighted residual factors for all reflections included in the refinement | 0.1003 |
Goodness-of-fit parameter for all reflections included in the refinement | 1.015 |
Diffraction radiation wavelength | 0.71073 Å |
Diffraction radiation type | MoKα |