Information card for entry 7034489
Common name | MnN3O2-Mn(CN)6 |
Formula | C36 H52 Cl Mn3 N12 O13 |
Calculated formula | C36 H52 Cl Mn3 N12 O13 |
Title of publication | Syntheses, structures, and magnetic properties of three new cyano-bridged complexes based on the [Mn(CN)6](3-) building block. |
Authors of publication | Zhang, Shao-Liang; Zhao, Xin-Hua; Wang, Xin-Yi |
Journal of publication | Dalton transactions (Cambridge, England : 2003) |
Year of publication | 2015 |
Journal volume | 44 |
Journal issue | 34 |
Pages of publication | 15189 - 15197 |
a | 39.847 ± 0.003 Å |
b | 13.2542 ± 0.0011 Å |
c | 18.3527 ± 0.0014 Å |
α | 90° |
β | 102.573 ± 0.001° |
γ | 90° |
Cell volume | 9460.4 ± 1.3 Å3 |
Cell temperature | 120 ± 2 K |
Ambient diffraction temperature | 120 ± 2 K |
Number of distinct elements | 6 |
Space group number | 15 |
Hermann-Mauguin space group symbol | C 1 2/c 1 |
Hall space group symbol | -C 2yc |
Residual factor for all reflections | 0.0522 |
Residual factor for significantly intense reflections | 0.0398 |
Weighted residual factors for significantly intense reflections | 0.1177 |
Weighted residual factors for all reflections included in the refinement | 0.1244 |
Goodness-of-fit parameter for all reflections included in the refinement | 1.037 |
Diffraction radiation wavelength | 0.71073 Å |
Diffraction radiation type | MoKα |