Information card for entry 7034490
Common name | MnN5-Mn(CN)6 |
Formula | C57 H69 Mn5 N27 |
Calculated formula | C57 H69 Mn5 N27 |
Title of publication | Syntheses, structures, and magnetic properties of three new cyano-bridged complexes based on the [Mn(CN)6](3-) building block. |
Authors of publication | Zhang, Shao-Liang; Zhao, Xin-Hua; Wang, Xin-Yi |
Journal of publication | Dalton transactions (Cambridge, England : 2003) |
Year of publication | 2015 |
Journal volume | 44 |
Journal issue | 34 |
Pages of publication | 15189 - 15197 |
a | 11.418 ± 0.002 Å |
b | 16.938 ± 0.003 Å |
c | 20.679 ± 0.004 Å |
α | 97.553 ± 0.003° |
β | 94.078 ± 0.003° |
γ | 106.831 ± 0.003° |
Cell volume | 3769.5 ± 1.2 Å3 |
Cell temperature | 120 ± 2 K |
Ambient diffraction temperature | 120 ± 2 K |
Number of distinct elements | 4 |
Space group number | 2 |
Hermann-Mauguin space group symbol | P -1 |
Hall space group symbol | -P 1 |
Residual factor for all reflections | 0.1429 |
Residual factor for significantly intense reflections | 0.0885 |
Weighted residual factors for significantly intense reflections | 0.233 |
Weighted residual factors for all reflections included in the refinement | 0.2549 |
Goodness-of-fit parameter for all reflections included in the refinement | 1.052 |
Diffraction radiation wavelength | 0.71073 Å |
Diffraction radiation type | MoKα |