Information card for entry 7034491
Common name | MnN5Me-Mn(CN)6 |
Formula | C57 H95 Mn5 N27 O10 |
Calculated formula | C57 H77 Mn5 N27 O10 |
Title of publication | Syntheses, structures, and magnetic properties of three new cyano-bridged complexes based on the [Mn(CN)6](3-) building block. |
Authors of publication | Zhang, Shao-Liang; Zhao, Xin-Hua; Wang, Xin-Yi |
Journal of publication | Dalton transactions (Cambridge, England : 2003) |
Year of publication | 2015 |
Journal volume | 44 |
Journal issue | 34 |
Pages of publication | 15189 - 15197 |
a | 11.467 ± 0.006 Å |
b | 17.402 ± 0.01 Å |
c | 20.493 ± 0.011 Å |
α | 100.383 ± 0.008° |
β | 90.651 ± 0.008° |
γ | 108.525 ± 0.008° |
Cell volume | 3804 ± 4 Å3 |
Cell temperature | 120 ± 2 K |
Ambient diffraction temperature | 120 ± 2 K |
Number of distinct elements | 5 |
Space group number | 2 |
Hermann-Mauguin space group symbol | P -1 |
Hall space group symbol | -P 1 |
Residual factor for all reflections | 0.191 |
Residual factor for significantly intense reflections | 0.0842 |
Weighted residual factors for significantly intense reflections | 0.1775 |
Weighted residual factors for all reflections included in the refinement | 0.2079 |
Goodness-of-fit parameter for all reflections included in the refinement | 1.048 |
Diffraction radiation wavelength | 0.71073 Å |
Diffraction radiation type | MoKα |