Information card for entry 7034493
Formula | C20 H25 Cd2 Cl2 N6 O16 Tb |
Calculated formula | C20 H25 Cd2 Cl2 N6 O16 Tb |
Title of publication | An unusual three-dimensional Dy-Cd2 framework exhibiting single-ion magnet behavior. |
Authors of publication | Zhang, Xue-Jing; Liu, Ke; Bing, Yan-Min; Xu, Na; Shi, Wei; Cheng, Peng |
Journal of publication | Dalton transactions (Cambridge, England : 2003) |
Year of publication | 2015 |
Journal volume | 44 |
Journal issue | 17 |
Pages of publication | 7757 - 7760 |
a | 12.5247 ± 0.0005 Å |
b | 32.2184 ± 0.0016 Å |
c | 7.6101 ± 0.0005 Å |
α | 90° |
β | 98.856 ± 0.004° |
γ | 90° |
Cell volume | 3034.3 ± 0.3 Å3 |
Cell temperature | 130.65 ± 0.1 K |
Ambient diffraction temperature | 130.65 ± 0.1 K |
Number of distinct elements | 7 |
Space group number | 9 |
Hermann-Mauguin space group symbol | C 1 c 1 |
Hall space group symbol | C -2yc |
Residual factor for all reflections | 0.0336 |
Residual factor for significantly intense reflections | 0.0321 |
Weighted residual factors for significantly intense reflections | 0.0673 |
Weighted residual factors for all reflections included in the refinement | 0.0683 |
Goodness-of-fit parameter for all reflections included in the refinement | 1.027 |
Diffraction radiation wavelength | 0.71073 Å |
Diffraction radiation type | MoKα |