Information card for entry 7034494
Formula | C138 H138 Cu6 Eu6 N12 O62 |
Calculated formula | C138 H138 Cu6 Eu6 N12 O62 |
Title of publication | Ascorbic acid decomposition into oxalate ions: a simple synthetic route towards oxalato-bridged heterometallic 3d-4f clusters. |
Authors of publication | Dinca, Alina S.; Shova, Sergiu; Ion, Adrian E.; Maxim, Catalin; Lloret, Francesc; Julve, Miguel; Andruh, Marius |
Journal of publication | Dalton transactions (Cambridge, England : 2003) |
Year of publication | 2015 |
Journal volume | 44 |
Journal issue | 16 |
Pages of publication | 7148 - 7151 |
a | 15.1982 ± 0.0012 Å |
b | 18.9472 ± 0.0012 Å |
c | 19.5041 ± 0.0013 Å |
α | 116.336 ± 0.006° |
β | 100.484 ± 0.006° |
γ | 93.871 ± 0.006° |
Cell volume | 4879 ± 0.7 Å3 |
Cell temperature | 173 ± 0.14 K |
Ambient diffraction temperature | 173 ± 0.14 K |
Number of distinct elements | 6 |
Space group number | 2 |
Hermann-Mauguin space group symbol | P -1 |
Hall space group symbol | -P 1 |
Residual factor for all reflections | 0.1129 |
Residual factor for significantly intense reflections | 0.0766 |
Weighted residual factors for significantly intense reflections | 0.1928 |
Weighted residual factors for all reflections included in the refinement | 0.2144 |
Goodness-of-fit parameter for all reflections included in the refinement | 1.023 |
Diffraction radiation wavelength | 0.71073 Å |
Diffraction radiation type | MoKα |