Information card for entry 7034499
Formula | C150 H173.4 Dy6 N13 Ni6 O68.7 |
Calculated formula | C150 H173.4 Dy6 N13 Ni6 O68.7 |
Title of publication | Ascorbic acid decomposition into oxalate ions: a simple synthetic route towards oxalato-bridged heterometallic 3d-4f clusters. |
Authors of publication | Dinca, Alina S.; Shova, Sergiu; Ion, Adrian E.; Maxim, Catalin; Lloret, Francesc; Julve, Miguel; Andruh, Marius |
Journal of publication | Dalton transactions (Cambridge, England : 2003) |
Year of publication | 2015 |
Journal volume | 44 |
Journal issue | 16 |
Pages of publication | 7148 - 7151 |
a | 15.1001 ± 0.0006 Å |
b | 27.9469 ± 0.0009 Å |
c | 25.5495 ± 0.0007 Å |
α | 90° |
β | 93.399 ± 0.003° |
γ | 90° |
Cell volume | 10762.9 ± 0.6 Å3 |
Cell temperature | 173.05 ± 0.1 K |
Ambient diffraction temperature | 173.05 ± 0.1 K |
Number of distinct elements | 6 |
Space group number | 14 |
Hermann-Mauguin space group symbol | P 1 21/n 1 |
Hall space group symbol | -P 2yn |
Residual factor for all reflections | 0.1337 |
Residual factor for significantly intense reflections | 0.071 |
Weighted residual factors for significantly intense reflections | 0.1056 |
Weighted residual factors for all reflections included in the refinement | 0.1207 |
Goodness-of-fit parameter for all reflections included in the refinement | 1.005 |
Diffraction radiation wavelength | 0.71073 Å |
Diffraction radiation type | MoKα |