Information card for entry 7034500
Formula | C143.5 H172.2 Dy6 N12 O71.6 Zn6 |
Calculated formula | C143.5 H172.2 Dy6 N12 O71.6 Zn6 |
Title of publication | Ascorbic acid decomposition into oxalate ions: a simple synthetic route towards oxalato-bridged heterometallic 3d-4f clusters. |
Authors of publication | Dinca, Alina S.; Shova, Sergiu; Ion, Adrian E.; Maxim, Catalin; Lloret, Francesc; Julve, Miguel; Andruh, Marius |
Journal of publication | Dalton transactions (Cambridge, England : 2003) |
Year of publication | 2015 |
Journal volume | 44 |
Journal issue | 16 |
Pages of publication | 7148 - 7151 |
a | 15.113 ± 0.0003 Å |
b | 26.555 ± 0.0004 Å |
c | 24.6138 ± 0.0005 Å |
α | 90° |
β | 90.858 ± 0.006° |
γ | 90° |
Cell volume | 9877 ± 0.3 Å3 |
Cell temperature | 293 ± 2 K |
Ambient diffraction temperature | 293 ± 2 K |
Number of distinct elements | 6 |
Space group number | 14 |
Hermann-Mauguin space group symbol | P 1 21/n 1 |
Hall space group symbol | -P 2yn |
Residual factor for all reflections | 0.2338 |
Residual factor for significantly intense reflections | 0.0636 |
Weighted residual factors for significantly intense reflections | 0.1168 |
Weighted residual factors for all reflections included in the refinement | 0.1662 |
Goodness-of-fit parameter for all reflections included in the refinement | 0.661 |
Diffraction radiation wavelength | 0.71073 Å |
Diffraction radiation type | MoKα |