Information card for entry 7034502
Formula | C29 H38 Ti |
Calculated formula | C29 H38 Ti |
SMILES | [Ti]123456789([c]%10([c]1([c]2([c]3([c]4%10C)C)C)C)C)([c]1([c]8([c]7([c]6([c]51C)C)C)C)C)[C](#[C]9c1ccccc1)C |
Title of publication | Displacement of ethene from the decamethyltitanocene-ethene complex with internal alkynes, substituent-dependent alkyne-to-allene rearrangement, and the electronic transition relevant to the back-bonding interaction. |
Authors of publication | Pinkas, Jiří; Gyepes, Róbert; Císařová, Ivana; Kubišta, Jiří; Horáček, Michal; Mach, Karel |
Journal of publication | Dalton transactions (Cambridge, England : 2003) |
Year of publication | 2015 |
Journal volume | 44 |
Journal issue | 16 |
Pages of publication | 7276 - 7291 |
a | 9.7137 ± 0.0004 Å |
b | 17.114 ± 0.0006 Å |
c | 14.6646 ± 0.0008 Å |
α | 90° |
β | 92.48 ± 0.002° |
γ | 90° |
Cell volume | 2435.56 ± 0.19 Å3 |
Cell temperature | 150 ± 2 K |
Ambient diffraction temperature | 150 ± 2 K |
Number of distinct elements | 3 |
Space group number | 14 |
Hermann-Mauguin space group symbol | P 1 21/n 1 |
Hall space group symbol | -P 2yn |
Residual factor for all reflections | 0.0595 |
Residual factor for significantly intense reflections | 0.0384 |
Weighted residual factors for significantly intense reflections | 0.0923 |
Weighted residual factors for all reflections included in the refinement | 0.1017 |
Goodness-of-fit parameter for all reflections included in the refinement | 1.018 |
Diffraction radiation wavelength | 0.71073 Å |
Diffraction radiation type | MoKα |