Information card for entry 7034503
Formula | C31 H44 Si Ti |
Calculated formula | C31 H44 Si Ti |
SMILES | [Ti]123456789([c]%10([c]4([c]3([c]2([c]1%10C)C)C)C)C)([c]1([c]8([c]7([c]6([c]51C)C)C)C)C)[C](#[C]9c1ccccc1)[Si](C)(C)C |
Title of publication | Displacement of ethene from the decamethyltitanocene-ethene complex with internal alkynes, substituent-dependent alkyne-to-allene rearrangement, and the electronic transition relevant to the back-bonding interaction. |
Authors of publication | Pinkas, Jiří; Gyepes, Róbert; Císařová, Ivana; Kubišta, Jiří; Horáček, Michal; Mach, Karel |
Journal of publication | Dalton transactions (Cambridge, England : 2003) |
Year of publication | 2015 |
Journal volume | 44 |
Journal issue | 16 |
Pages of publication | 7276 - 7291 |
a | 17.9326 ± 0.0006 Å |
b | 9.3275 ± 0.0003 Å |
c | 16.6995 ± 0.0006 Å |
α | 90° |
β | 90° |
γ | 90° |
Cell volume | 2793.26 ± 0.16 Å3 |
Cell temperature | 150 ± 2 K |
Ambient diffraction temperature | 150 ± 2 K |
Number of distinct elements | 4 |
Space group number | 29 |
Hermann-Mauguin space group symbol | P c a 21 |
Hall space group symbol | P 2c -2ac |
Residual factor for all reflections | 0.0367 |
Residual factor for significantly intense reflections | 0.0307 |
Weighted residual factors for significantly intense reflections | 0.0744 |
Weighted residual factors for all reflections included in the refinement | 0.0768 |
Goodness-of-fit parameter for all reflections included in the refinement | 1.052 |
Diffraction radiation wavelength | 0.71073 Å |
Diffraction radiation type | MoKα |