Information card for entry 7034523
Formula | C82 H58 Co N8 O28 Tb4 |
Calculated formula | C82 H58 Co N8 O28 Tb4 |
Title of publication | Two novel 3d-4f heterometallic coordination polymers with infinite [Ln4(OH)4]n(8n+) chains involving in situ decarboxylation. |
Authors of publication | Wu, Wen-Ya; Zhang, Rui-Feng; Zhang, Xue-Jing; Cheng, Peng |
Journal of publication | Dalton transactions (Cambridge, England : 2003) |
Year of publication | 2015 |
Journal volume | 44 |
Journal issue | 16 |
Pages of publication | 7144 - 7147 |
a | 7.6995 ± 0.0015 Å |
b | 13.641 ± 0.003 Å |
c | 19.04 ± 0.004 Å |
α | 109.24 ± 0.03° |
β | 93.49 ± 0.03° |
γ | 92.7 ± 0.03° |
Cell volume | 1879.8 ± 0.8 Å3 |
Cell temperature | 293 ± 2 K |
Ambient diffraction temperature | 293 ± 2 K |
Number of distinct elements | 6 |
Space group number | 2 |
Hermann-Mauguin space group symbol | P -1 |
Hall space group symbol | -P 1 |
Residual factor for all reflections | 0.0413 |
Residual factor for significantly intense reflections | 0.033 |
Weighted residual factors for significantly intense reflections | 0.0866 |
Weighted residual factors for all reflections included in the refinement | 0.0924 |
Goodness-of-fit parameter for all reflections included in the refinement | 1.085 |
Diffraction radiation wavelength | 0.71073 Å |
Diffraction radiation type | MoKα |