Information card for entry 7034524
Formula | C82 H58 Co Dy4 N8 O28 |
Calculated formula | C82 H58 Co Dy4 N8 O28 |
Title of publication | Two novel 3d-4f heterometallic coordination polymers with infinite [Ln4(OH)4]n(8n+) chains involving in situ decarboxylation. |
Authors of publication | Wu, Wen-Ya; Zhang, Rui-Feng; Zhang, Xue-Jing; Cheng, Peng |
Journal of publication | Dalton transactions (Cambridge, England : 2003) |
Year of publication | 2015 |
Journal volume | 44 |
Journal issue | 16 |
Pages of publication | 7144 - 7147 |
a | 7.6805 ± 0.0015 Å |
b | 13.635 ± 0.003 Å |
c | 19.036 ± 0.004 Å |
α | 109.16 ± 0.03° |
β | 93.43 ± 0.03° |
γ | 92.75 ± 0.03° |
Cell volume | 1874.9 ± 0.8 Å3 |
Cell temperature | 293 ± 2 K |
Ambient diffraction temperature | 293 ± 2 K |
Number of distinct elements | 6 |
Space group number | 2 |
Hermann-Mauguin space group symbol | P -1 |
Hall space group symbol | -P 1 |
Residual factor for all reflections | 0.0358 |
Residual factor for significantly intense reflections | 0.0299 |
Weighted residual factors for significantly intense reflections | 0.0715 |
Weighted residual factors for all reflections included in the refinement | 0.077 |
Goodness-of-fit parameter for all reflections included in the refinement | 1.097 |
Diffraction radiation wavelength | 0.71073 Å |
Diffraction radiation type | MoKα |