Information card for entry 7034541
Formula | C48 H90 N6 Ni O4 |
Calculated formula | C48 H90 N6 Ni O4 |
Title of publication | Magnetic superexchange interactions: trinuclear bis(oxamidato) versus bis(oxamato) type complexes. |
Authors of publication | Abdulmalic, Mohammad A.; Aliabadi, Azar; Petr, Andreas; Krupskaya, Yulia; Kataev, Vladislav; Büchner, Bernd; Zaripov, Ruslan; Vavilova, Evgeniya; Voronkova, Violeta; Salikov, Kev; Hahn, Torsten; Kortus, Jens; Eya'ane Meva, Francois; Schaarschmidt, Dieter; Rüffer, Tobias |
Journal of publication | Dalton transactions (Cambridge, England : 2003) |
Year of publication | 2015 |
Journal volume | 44 |
Journal issue | 17 |
Pages of publication | 8062 - 8079 |
a | 13.5126 ± 0.0005 Å |
b | 14.7246 ± 0.0004 Å |
c | 25.4056 ± 0.0007 Å |
α | 90° |
β | 95.567 ± 0.003° |
γ | 90° |
Cell volume | 5031.1 ± 0.3 Å3 |
Cell temperature | 110 K |
Ambient diffraction temperature | 110 K |
Number of distinct elements | 5 |
Space group number | 4 |
Hermann-Mauguin space group symbol | P 1 21 1 |
Hall space group symbol | P 2yb |
Residual factor for all reflections | 0.1361 |
Residual factor for significantly intense reflections | 0.0991 |
Weighted residual factors for significantly intense reflections | 0.2531 |
Weighted residual factors for all reflections included in the refinement | 0.2794 |
Goodness-of-fit parameter for all reflections included in the refinement | 0.961 |
Diffraction radiation wavelength | 1.54184 Å |
Diffraction radiation type | CuKα |