Information card for entry 7034542
Formula | C44 H82 Cu N6 O4 |
Calculated formula | C44 H82 Cu N6 O4 |
Title of publication | Magnetic superexchange interactions: trinuclear bis(oxamidato) versus bis(oxamato) type complexes. |
Authors of publication | Abdulmalic, Mohammad A.; Aliabadi, Azar; Petr, Andreas; Krupskaya, Yulia; Kataev, Vladislav; Büchner, Bernd; Zaripov, Ruslan; Vavilova, Evgeniya; Voronkova, Violeta; Salikov, Kev; Hahn, Torsten; Kortus, Jens; Eya'ane Meva, Francois; Schaarschmidt, Dieter; Rüffer, Tobias |
Journal of publication | Dalton transactions (Cambridge, England : 2003) |
Year of publication | 2015 |
Journal volume | 44 |
Journal issue | 17 |
Pages of publication | 8062 - 8079 |
a | 10.5836 ± 0.0013 Å |
b | 14.534 ± 0.003 Å |
c | 15.6095 ± 0.0015 Å |
α | 98.444 ± 0.011° |
β | 91.564 ± 0.009° |
γ | 102.014 ± 0.012° |
Cell volume | 2318.9 ± 0.6 Å3 |
Cell temperature | 100 K |
Ambient diffraction temperature | 100 K |
Number of distinct elements | 5 |
Space group number | 2 |
Hermann-Mauguin space group symbol | P -1 |
Hall space group symbol | -P 1 |
Residual factor for all reflections | 0.0497 |
Residual factor for significantly intense reflections | 0.0345 |
Weighted residual factors for significantly intense reflections | 0.085 |
Weighted residual factors for all reflections included in the refinement | 0.0892 |
Goodness-of-fit parameter for all reflections included in the refinement | 0.939 |
Diffraction radiation wavelength | 1.54184 Å |
Diffraction radiation type | CuKα |