Information card for entry 7034544
Formula | C48 H90 Cu N6 O4 |
Calculated formula | C48 H90 Cu N6 O4 |
Title of publication | Magnetic superexchange interactions: trinuclear bis(oxamidato) versus bis(oxamato) type complexes. |
Authors of publication | Abdulmalic, Mohammad A.; Aliabadi, Azar; Petr, Andreas; Krupskaya, Yulia; Kataev, Vladislav; Büchner, Bernd; Zaripov, Ruslan; Vavilova, Evgeniya; Voronkova, Violeta; Salikov, Kev; Hahn, Torsten; Kortus, Jens; Eya'ane Meva, Francois; Schaarschmidt, Dieter; Rüffer, Tobias |
Journal of publication | Dalton transactions (Cambridge, England : 2003) |
Year of publication | 2015 |
Journal volume | 44 |
Journal issue | 17 |
Pages of publication | 8062 - 8079 |
a | 13.4875 ± 0.0006 Å |
b | 14.6748 ± 0.0007 Å |
c | 25.614 ± 0.0012 Å |
α | 90° |
β | 95.346 ± 0.004° |
γ | 90° |
Cell volume | 5047.6 ± 0.4 Å3 |
Cell temperature | 100 K |
Ambient diffraction temperature | 100 K |
Number of distinct elements | 5 |
Space group number | 14 |
Hermann-Mauguin space group symbol | P 1 21/c 1 |
Hall space group symbol | -P 2ybc |
Residual factor for all reflections | 0.1498 |
Residual factor for significantly intense reflections | 0.0883 |
Weighted residual factors for significantly intense reflections | 0.2625 |
Weighted residual factors for all reflections included in the refinement | 0.298 |
Goodness-of-fit parameter for all reflections included in the refinement | 0.974 |
Diffraction radiation wavelength | 1.54184 Å |
Diffraction radiation type | CuKα |