Information card for entry 7034543
Formula | C46 H90 Cu N6 O6 |
Calculated formula | C46 H90 Cu N6 O6 |
SMILES | C1(=O)C(=O)N(CC)[Cu]23N1c1ccccc1N2C(=O)C(=O)N3CC.C(CCC)[N+](CCCC)(CCCC)CCCC.O.C(CCC)[N+](CCCC)(CCCC)CCCC.O |
Title of publication | Magnetic superexchange interactions: trinuclear bis(oxamidato) versus bis(oxamato) type complexes. |
Authors of publication | Abdulmalic, Mohammad A.; Aliabadi, Azar; Petr, Andreas; Krupskaya, Yulia; Kataev, Vladislav; Büchner, Bernd; Zaripov, Ruslan; Vavilova, Evgeniya; Voronkova, Violeta; Salikov, Kev; Hahn, Torsten; Kortus, Jens; Eya'ane Meva, Francois; Schaarschmidt, Dieter; Rüffer, Tobias |
Journal of publication | Dalton transactions (Cambridge, England : 2003) |
Year of publication | 2015 |
Journal volume | 44 |
Journal issue | 17 |
Pages of publication | 8062 - 8079 |
a | 24.396 ± 0.005 Å |
b | 13.432 ± 0.003 Å |
c | 15.919 ± 0.003 Å |
α | 90° |
β | 109.8 ± 0.03° |
γ | 90° |
Cell volume | 4908 ± 2 Å3 |
Cell temperature | 100 K |
Ambient diffraction temperature | 100 K |
Number of distinct elements | 5 |
Space group number | 15 |
Hermann-Mauguin space group symbol | C 1 2/c 1 |
Hall space group symbol | -C 2yc |
Residual factor for all reflections | 0.0463 |
Residual factor for significantly intense reflections | 0.0368 |
Weighted residual factors for significantly intense reflections | 0.0933 |
Weighted residual factors for all reflections included in the refinement | 0.1013 |
Goodness-of-fit parameter for all reflections included in the refinement | 1.06 |
Diffraction radiation wavelength | 0.71073 Å |
Diffraction radiation type | MoKα |